{"text_format":"3","workbook":"xlsx","n_sheets":7,"sheets":["表紙","12","34男","34女","56男","56女","syozoku"],"not_rendered":{"macros":1},"read":"whole","date_system":"1900"}

{"sheet":"表紙","index":0,"n_rows":26,"n_cols":9,"rows_kept":26}
[2021,"年度　ライスカップ　申込ファイル"]
[]
["クラブ名",null,"←プルダウンリストより選択",{"$nulls":3},"クラブコード",{"$f":"IF($B$3=\"\",\"\",VLOOKUP($B$3,syozoku!$C:$G,4,FALSE))","v":""}]
["申込責任者",null,"←責任者のお名前を入力",{"$nulls":3},"ゼッケン初期値",{"$f":"IF($B$3=\"\",\"\",VLOOKUP($B$3,syozoku!$C:$G,4,FALSE)*100)","v":""}]
["責任者連絡先",null,"←責任者の電話番号を入力",{"$nulls":3},"クラブ略称",{"$f":"IF($B$3=\"\",\"\",VLOOKUP($B$3,syozoku!$C:$G,2,FALSE))","v":""}]
["責任者メール",null,"←責任者のメールアドレスを入力",{"$nulls":3},"DB初期値",{"$f":"IF($B$3=\"\",\"\",VLOOKUP($B$3,syozoku!$C:$G,4,FALSE)*10000)","v":""}]
[null,"審判員名前","希望係担当","陸上経験"]
["審判員１",{"$nulls":5},"○"]
["審判員２",{"$nulls":5},"中学年補員レース","８００ｍ",{"$f":"IF(H9=\"\",\"\",\"R\" & VLOOKUP($H$9,$G$13:H26,2,FALSE) & \"0\")","v":"R0060"}]
["審判員３",{"$nulls":5},"高学年補員レース","１０００ｍ",{"$f":"IF(H10=\"\",\"\",\"R\" & VLOOKUP($H$9,$G$13:H27,2,FALSE) & \"0\")","v":"R0060"}]
["審判員４"]
["審判員５"]
[null,"↑審判員お名前を入力","↑希望する係があれば入力","↑陸上経験ありならば○を入力",null,null,"５０ｍ",421]
[{"$nulls":6},"６０ｍ","001"]
[{"$nulls":6},"１００ｍ","002"]
[{"$nulls":6},"ジグザグ５０ｍ",422]
[{"$nulls":6},"２００ｍ","003"]
[{"$nulls":6},"３００ｍ","004"]
[{"$nulls":6},"４００ｍ","005"]
[{"$nulls":6},"５００ｍ","050"]
[{"$nulls":6},"８００ｍ","006"]
[{"$nulls":6},"１０００ｍ","007"]
[{"$nulls":6},"１５００ｍ","008"]
[{"$nulls":6},"２０００ｍ","009"]
[{"$nulls":6},"３０００ｍ","010"]
[{"$nulls":6},"５０００ｍ","011"]

{"sheet":"12","index":1,"n_rows":52,"n_cols":18,"rows_kept":52}
[null,{"$f":"表紙!A1","v":2021},"年度　小学生マラソン大会　入力欄",{"$nulls":7},"マスター系CSV作成"]
["No.","学年","性別","名前","フリガナ（半角カナ）",null,"クラブコード",{"$f":"表紙!H3","v":""},null,null,"DB","N1","N2","SX","KC","MC","ZK","S1"]
[1,1,"男",1,1,null,"ゼッケン初期値",{"$f":"表紙!H4","v":""},null,null,{"$f":"IF($D3=\"\",\"\",B3*100000000+$H$5+$H$6+$A3)","v":{"$error":"#VALUE!"}},{"$f":"IF($D3=\"\",\"\",CONCATENATE(D3,\"(\",B3,\")\",))","v":"1(1)"},{"$f":"IF($D3=\"\",\"\",E3)","v":1},{"$f":"IF($D3=\"\",\"\",IF(C3=\"男\",1,2))","v":1},{"$f":"IF($D3=\"\",\"\",10)","v":10},{"$f":"IF($D3=\"\",\"\",$H$2)","v":""},{"$f":"IF($D3=\"\",\"\",K3)","v":{"$error":"#VALUE!"}},{"$f":"IF($D3=\"\",\"\",CONCATENATE(\"R0500\",B3))","v":"R05001"}]
[2,2,"男",2,2,null,"クラブ略称",{"$f":"表紙!H5","v":""},null,null,{"$f":"IF($D4=\"\",\"\",B4*100000000+$H$5+$H$6+$A4)","v":{"$error":"#VALUE!"}},{"$f":"IF($D4=\"\",\"\",CONCATENATE(D4,\"(\",B4,\")\",))","v":"2(2)"},{"$f":"IF($D4=\"\",\"\",E4)","v":2},{"$f":"IF($D4=\"\",\"\",IF(C4=\"男\",1,2))","v":1},{"$f":"IF($D4=\"\",\"\",10)","v":10},{"$f":"IF($D4=\"\",\"\",$H$2)","v":""},{"$f":"IF($D4=\"\",\"\",K4)","v":{"$error":"#VALUE!"}},{"$f":"IF($D4=\"\",\"\",CONCATENATE(\"R0500\",B4))","v":"R05002"}]
[3,1,"男",3,3,null,"DB初期値",{"$f":"表紙!H6","v":""},null,null,{"$error":"#VALUE!"},"3(1)",3,1,10,"",{"$error":"#VALUE!"},"R05001"]
[4,2,"男",4,4,null,"種目固有数",100,null,null,{"$error":"#VALUE!"},"4(2)",4,1,10,"",{"$error":"#VALUE!"},"R05002"]
[5,1,"男",5,5,null,"学年",1,null,null,{"$error":"#VALUE!"},"5(1)",5,1,10,"",{"$error":"#VALUE!"},"R05001"]
[6,2,"男",6,6,null,null,2,null,null,{"$error":"#VALUE!"},"6(2)",6,1,10,"",{"$error":"#VALUE!"},"R05002"]
[7,1,"男",7,7,{"$nulls":5},{"$error":"#VALUE!"},"7(1)",7,1,10,"",{"$error":"#VALUE!"},"R05001"]
[8,2,"男",8,8,null,"性別","男",null,null,{"$error":"#VALUE!"},"8(2)",8,1,10,"",{"$error":"#VALUE!"},"R05002"]
[9,1,"男",9,9,null,null,"女",null,null,{"$error":"#VALUE!"},"9(1)",9,1,10,"",{"$error":"#VALUE!"},"R05001"]
[10,2,"男",10,10,{"$nulls":5},{"$error":"#VALUE!"},"10(2)",10,1,10,"",{"$error":"#VALUE!"},"R05002"]
[11,1,"男",11,11,{"$nulls":5},{"$error":"#VALUE!"},"11(1)",11,1,10,"",{"$error":"#VALUE!"},"R05001"]
[12,2,"男",12,12,{"$nulls":5},{"$error":"#VALUE!"},"12(2)",12,1,10,"",{"$error":"#VALUE!"},"R05002"]
[13,1,"男",13,13,{"$nulls":5},{"$error":"#VALUE!"},"13(1)",13,1,10,"",{"$error":"#VALUE!"},"R05001"]
[14,2,"男",14,14,{"$nulls":5},{"$error":"#VALUE!"},"14(2)",14,1,10,"",{"$error":"#VALUE!"},"R05002"]
[15,1,"男",15,15,{"$nulls":5},{"$error":"#VALUE!"},"15(1)",15,1,10,"",{"$error":"#VALUE!"},"R05001"]
[16,2,"男",16,16,{"$nulls":5},{"$error":"#VALUE!"},"16(2)",16,1,10,"",{"$error":"#VALUE!"},"R05002"]
[17,1,"男",17,17,{"$nulls":5},{"$error":"#VALUE!"},"17(1)",17,1,10,"",{"$error":"#VALUE!"},"R05001"]
[18,2,"男",18,18,{"$nulls":5},{"$error":"#VALUE!"},"18(2)",18,1,10,"",{"$error":"#VALUE!"},"R05002"]
[19,1,"男",19,19,{"$nulls":5},{"$error":"#VALUE!"},"19(1)",19,1,10,"",{"$error":"#VALUE!"},"R05001"]
[20,2,"男",20,20,{"$nulls":5},{"$error":"#VALUE!"},"20(2)",20,1,10,"",{"$error":"#VALUE!"},"R05002"]
[21,1,"男",21,21,{"$nulls":5},{"$error":"#VALUE!"},"21(1)",21,1,10,"",{"$error":"#VALUE!"},"R05001"]
[22,2,"男",22,22,{"$nulls":5},{"$error":"#VALUE!"},"22(2)",22,1,10,"",{"$error":"#VALUE!"},"R05002"]
[23,1,"男",23,23,{"$nulls":5},{"$error":"#VALUE!"},"23(1)",23,1,10,"",{"$error":"#VALUE!"},"R05001"]
[24,2,"男",24,24,{"$nulls":5},{"$error":"#VALUE!"},"24(2)",24,1,10,"",{"$error":"#VALUE!"},"R05002"]
[25,1,"男",25,25,{"$nulls":5},{"$error":"#VALUE!"},"25(1)",25,1,10,"",{"$error":"#VALUE!"},"R05001"]
[26,2,"女",26,26,{"$nulls":5},{"$error":"#VALUE!"},"26(2)",26,2,10,"",{"$error":"#VALUE!"},"R05002"]
[27,1,"女",27,27,{"$nulls":5},{"$error":"#VALUE!"},"27(1)",27,2,10,"",{"$error":"#VALUE!"},"R05001"]
[28,2,"女",28,28,{"$nulls":5},{"$error":"#VALUE!"},"28(2)",28,2,10,"",{"$error":"#VALUE!"},"R05002"]
[29,1,"女",29,29,{"$nulls":5},{"$error":"#VALUE!"},"29(1)",29,2,10,"",{"$error":"#VALUE!"},"R05001"]
[30,2,"女",30,30,{"$nulls":5},{"$error":"#VALUE!"},"30(2)",30,2,10,"",{"$error":"#VALUE!"},"R05002"]
[31,1,"女",31,31,{"$nulls":5},{"$error":"#VALUE!"},"31(1)",31,2,10,"",{"$error":"#VALUE!"},"R05001"]
[32,2,"女",32,32,{"$nulls":5},{"$error":"#VALUE!"},"32(2)",32,2,10,"",{"$error":"#VALUE!"},"R05002"]
[33,1,"女",33,33,{"$nulls":5},{"$error":"#VALUE!"},"33(1)",33,2,10,"",{"$error":"#VALUE!"},"R05001"]
[34,2,"女",34,34,{"$nulls":5},{"$error":"#VALUE!"},"34(2)",34,2,10,"",{"$error":"#VALUE!"},"R05002"]
[35,1,"女",35,35,{"$nulls":5},{"$error":"#VALUE!"},"35(1)",35,2,10,"",{"$error":"#VALUE!"},"R05001"]
[36,2,"女",36,36,{"$nulls":5},{"$error":"#VALUE!"},"36(2)",36,2,10,"",{"$error":"#VALUE!"},"R05002"]
[37,1,"女",37,37,{"$nulls":5},{"$error":"#VALUE!"},"37(1)",37,2,10,"",{"$error":"#VALUE!"},"R05001"]
[38,2,"女",38,38,{"$nulls":5},{"$error":"#VALUE!"},"38(2)",38,2,10,"",{"$error":"#VALUE!"},"R05002"]
[39,1,"女",39,39,{"$nulls":5},{"$error":"#VALUE!"},"39(1)",39,2,10,"",{"$error":"#VALUE!"},"R05001"]
[40,2,"女",40,40,{"$nulls":5},{"$error":"#VALUE!"},"40(2)",40,2,10,"",{"$error":"#VALUE!"},"R05002"]
[41,1,"女",41,41,{"$nulls":5},{"$error":"#VALUE!"},"41(1)",41,2,10,"",{"$error":"#VALUE!"},"R05001"]
[42,2,"女",42,42,{"$nulls":5},{"$error":"#VALUE!"},"42(2)",42,2,10,"",{"$error":"#VALUE!"},"R05002"]
[43,1,"女",43,43,{"$nulls":5},{"$error":"#VALUE!"},"43(1)",43,2,10,"",{"$error":"#VALUE!"},"R05001"]
[44,2,"女",44,44,{"$nulls":5},{"$error":"#VALUE!"},"44(2)",44,2,10,"",{"$error":"#VALUE!"},"R05002"]
[45,1,"女",45,45,{"$nulls":5},{"$error":"#VALUE!"},"45(1)",45,2,10,"",{"$error":"#VALUE!"},"R05001"]
[46,2,"女",46,46,{"$nulls":5},{"$error":"#VALUE!"},"46(2)",46,2,10,"",{"$error":"#VALUE!"},"R05002"]
[47,1,"女",47,47,{"$nulls":5},{"$error":"#VALUE!"},"47(1)",47,2,10,"",{"$error":"#VALUE!"},"R05001"]
[48,2,"女",48,48,{"$nulls":5},{"$error":"#VALUE!"},"48(2)",48,2,10,"",{"$error":"#VALUE!"},"R05002"]
[49,1,"女",49,49,{"$nulls":5},{"$error":"#VALUE!"},"49(1)",49,2,10,"",{"$error":"#VALUE!"},"R05001"]
[50,2,"女",50,50,{"$nulls":5},{"$error":"#VALUE!"},"50(2)",50,2,10,"",{"$error":"#VALUE!"},"R05002"]

{"sheet":"34男","index":2,"n_rows":32,"n_cols":31,"rows_kept":32}
[null,{"$f":"表紙!A1","v":2021},"年度　ライスカップ　３４年男子　入力欄",{"$nulls":7},"マスター系CSV作成",{"$nulls":8},"メンバー系CSV作成",{"$nulls":6},"チーム系CSV作成"]
["No.","学年","名前","フリガナ（半角カナ）","担当",null,"クラブコード",{"$f":"表紙!H3","v":""},null,null,"DB","N1","N2","SX","KC","MC","ZK","s1",null,"TM","DB","N1","N2","KC","MC",null,"ZK","N1","N2","N3","OP"]
[1,null,"Aチーム1区","Aチーム1区","Aチーム1区",null,"ゼッケン初期値",{"$f":"表紙!H4","v":""},null,null,{"$f":"IF($D3=\"\",\"\",B3*100000000+$H$5+$H$6+$A3)","v":{"$error":"#VALUE!"}},{"$f":"IF($C3=\"\",\"\",CONCATENATE(C3,\"(\",B3,\")\",))","v":"Aチーム1区()"},{"$f":"IF($C3=\"\",\"\",D3)","v":"Aチーム1区"},{"$f":"IF($C3=\"\",\"\",1)","v":1},{"$f":"IF($C3=\"\",\"\",10)","v":10},{"$f":"IF($C3=\"\",\"\",$H$2)","v":""},{"$f":"IF($C3=\"\",\"\",K3)","v":{"$error":"#VALUE!"}},{"$f":"IF(C3=\"\",\"\",CONCATENATE(\"R17208\"))","v":"R17208"},0,{"$f":"IF(K3=\"\",\"\",$H$2*10+S3)","v":{"$error":"#VALUE!"}},{"$f":"IF(K3=\"\",\"\",K3)","v":{"$error":"#VALUE!"}},{"$f":"IF(U3=\"\",\"\",L3)","v":{"$error":"#VALUE!"}},{"$f":"IF(V3=\"\",\"\",M3)","v":{"$error":"#VALUE!"}},{"$f":"IF(W3=\"\",\"\",O3)","v":{"$error":"#VALUE!"}},{"$f":"IF(X3=\"\",\"\",P3)","v":{"$error":"#VALUE!"}},"A",{"$f":"IF(T3=\"\",\"\",T3)","v":{"$error":"#VALUE!"}},{"$f":"IF($AA$3=\"\",\"\",CONCATENATE($H$4,\" \",$Z3))","v":{"$error":"#VALUE!"}},{"$f":"IF($AA$3=\"\",\"\",表紙!$B$3)","v":{"$error":"#VALUE!"}},{"$f":"IF($AA$3=\"\",\"\",CONCATENATE(\"指導者\",\" \",表紙!$B$4))","v":{"$error":"#VALUE!"}},{"$f":"IF(AA3=\"\",\"\",0)","v":{"$error":"#VALUE!"}}]
[2,null,"Aチーム2区","Aチーム2区","Aチーム2区",null,"クラブ略称",{"$f":"表紙!H5","v":""},null,null,{"$f":"IF($D4=\"\",\"\",B4*100000000+$H$5+$H$6+$A4)","v":{"$error":"#VALUE!"}},{"$f":"IF($C4=\"\",\"\",CONCATENATE(C4,\"(\",B4,\")\",))","v":"Aチーム2区()"},{"$f":"IF($C4=\"\",\"\",D4)","v":"Aチーム2区"},{"$f":"IF($C4=\"\",\"\",1)","v":1},{"$f":"IF($C4=\"\",\"\",10)","v":10},{"$f":"IF($C4=\"\",\"\",$H$2)","v":""},{"$f":"IF($C4=\"\",\"\",K4)","v":{"$error":"#VALUE!"}},{"$f":"IF(C4=\"\",\"\",CONCATENATE(\"R17208\"))","v":"R17208"},0,{"$f":"IF(K4=\"\",\"\",$H$2*10+S4)","v":{"$error":"#VALUE!"}},{"$f":"IF(K4=\"\",\"\",K4)","v":{"$error":"#VALUE!"}},{"$f":"IF(U4=\"\",\"\",L4)","v":{"$error":"#VALUE!"}},{"$error":"#VALUE!"},{"$f":"IF(W4=\"\",\"\",O4)","v":{"$error":"#VALUE!"}},{"$error":"#VALUE!"}]
[3,null,"Aチーム3区","Aチーム3区","Aチーム3区",null,"DB初期値",{"$f":"表紙!H6","v":""},null,null,{"$error":"#VALUE!"},"Aチーム3区()","Aチーム3区",1,10,"",{"$error":"#VALUE!"},"R17208",0,{"$error":"#VALUE!"},{"$error":"#VALUE!"},{"$f":"IF(U5=\"\",\"\",L5)","v":{"$error":"#VALUE!"}},{"$error":"#VALUE!"},{"$f":"IF(W5=\"\",\"\",O5)","v":{"$error":"#VALUE!"}},{"$error":"#VALUE!"}]
[4,null,"Aチーム4区","Aチーム4区","Aチーム4区",null,"種目固有数",200,null,null,{"$error":"#VALUE!"},"Aチーム4区()","Aチーム4区",1,10,"",{"$error":"#VALUE!"},"R17208",0,{"$error":"#VALUE!"},{"$error":"#VALUE!"},{"$f":"IF(U6=\"\",\"\",L6)","v":{"$error":"#VALUE!"}},{"$error":"#VALUE!"},{"$f":"IF(W6=\"\",\"\",O6)","v":{"$error":"#VALUE!"}},{"$error":"#VALUE!"}]
[5,null,"Aチーム5区","Aチーム5区","Aチーム5区",null,"学年",3,null,null,{"$error":"#VALUE!"},"Aチーム5区()","Aチーム5区",1,10,"",{"$error":"#VALUE!"},"R17208",0,{"$error":"#VALUE!"},{"$error":"#VALUE!"},{"$f":"IF(U7=\"\",\"\",L7)","v":{"$error":"#VALUE!"}},{"$error":"#VALUE!"},{"$f":"IF(W7=\"\",\"\",O7)","v":{"$error":"#VALUE!"}},{"$error":"#VALUE!"}]
[6,{"$nulls":3},"Bチーム1区",null,null,4,null,null,"","","","","","","","",1,"","",{"$f":"IF(U8=\"\",\"\",L8)","v":""},"",{"$f":"IF(W8=\"\",\"\",O8)","v":""},"","B",{"$f":"IF(T8=\"\",\"\",T8)","v":""},{"$f":"IF($AA$3=\"\",\"\",CONCATENATE($H$4,\" \",$Z8))","v":{"$error":"#VALUE!"}},{"$f":"IF($AA$3=\"\",\"\",表紙!$B$3)","v":{"$error":"#VALUE!"}},{"$f":"IF($AA$3=\"\",\"\",CONCATENATE(\"指導者\",\" \",表紙!$B$4))","v":{"$error":"#VALUE!"}},{"$f":"IF(AA8=\"\",\"\",0)","v":""}]
[7,{"$nulls":3},"Bチーム2区",{"$nulls":5},"","",{"$f":"IF($C9=\"\",\"\",D9)","v":""},{"$f":"IF($C9=\"\",\"\",1)","v":""},{"$f":"IF($C9=\"\",\"\",10)","v":""},{"$f":"IF($C9=\"\",\"\",$H$2)","v":""},{"$f":"IF($C9=\"\",\"\",K9)","v":""},"",1,"","",{"$f":"IF(U9=\"\",\"\",L9)","v":""},"",{"$f":"IF(W9=\"\",\"\",O9)","v":""},""]
[8,{"$nulls":3},"Bチーム3区",null,"性別","男",null,null,"","",{"$f":"IF($C10=\"\",\"\",D10)","v":""},"","","",{"$f":"IF($C10=\"\",\"\",K10)","v":""},"",1,"","",{"$f":"IF(U10=\"\",\"\",L10)","v":""},"",{"$f":"IF(W10=\"\",\"\",O10)","v":""},""]
[9,{"$nulls":3},"Bチーム4区",null,null,"女",null,null,"","","","","","","","",1,"","",{"$f":"IF(U11=\"\",\"\",L11)","v":""},"",{"$f":"IF(W11=\"\",\"\",O11)","v":""},""]
[10,{"$nulls":3},"Bチーム5区",{"$nulls":5},"","","","","","","","",1,"","",{"$f":"IF(U12=\"\",\"\",L12)","v":""},"",{"$f":"IF(W12=\"\",\"\",O12)","v":""},""]
[11,{"$nulls":3},"Cチーム1区",{"$nulls":5},"","","","","","","","",2,"","",{"$f":"IF(U13=\"\",\"\",L13)","v":""},"",{"$f":"IF(W13=\"\",\"\",O13)","v":""},"","C",{"$f":"IF(T13=\"\",\"\",T13)","v":""},{"$f":"IF($AA$3=\"\",\"\",CONCATENATE($H$4,\" \",$Z13))","v":{"$error":"#VALUE!"}},{"$f":"IF($AA$3=\"\",\"\",表紙!$B$3)","v":{"$error":"#VALUE!"}},{"$f":"IF($AA$3=\"\",\"\",CONCATENATE(\"指導者\",\" \",表紙!$B$4))","v":{"$error":"#VALUE!"}},{"$f":"IF(AA13=\"\",\"\",0)","v":""}]
[12,{"$nulls":3},"Cチーム2区",{"$nulls":5},"","","","","","","","",2,"","",{"$f":"IF(U14=\"\",\"\",L14)","v":""},"",{"$f":"IF(W14=\"\",\"\",O14)","v":""},""]
[13,{"$nulls":3},"Cチーム3区",{"$nulls":5},"","",{"$f":"IF($C15=\"\",\"\",D15)","v":""},{"$f":"IF($C15=\"\",\"\",1)","v":""},{"$f":"IF($C15=\"\",\"\",10)","v":""},{"$f":"IF($C15=\"\",\"\",$H$2)","v":""},{"$f":"IF($C15=\"\",\"\",K15)","v":""},"",2,"","",{"$f":"IF(U15=\"\",\"\",L15)","v":""},"",{"$f":"IF(W15=\"\",\"\",O15)","v":""},""]
[14,{"$nulls":3},"Cチーム4区",{"$nulls":5},"","",{"$f":"IF($C16=\"\",\"\",D16)","v":""},"","","",{"$f":"IF($C16=\"\",\"\",K16)","v":""},"",2,"","",{"$f":"IF(U16=\"\",\"\",L16)","v":""},"",{"$f":"IF(W16=\"\",\"\",O16)","v":""},""]
[15,{"$nulls":3},"Cチーム5区",{"$nulls":5},"","","","","","","","",2,"","",{"$f":"IF(U17=\"\",\"\",L17)","v":""},"",{"$f":"IF(W17=\"\",\"\",O17)","v":""},""]
[16,{"$nulls":3},"Dチーム1区",{"$nulls":5},"","","","","","","","",3,"","",{"$f":"IF(U18=\"\",\"\",L18)","v":""},"",{"$f":"IF(W18=\"\",\"\",O18)","v":""},"","D",{"$f":"IF(T18=\"\",\"\",T18)","v":""},{"$f":"IF($AA$3=\"\",\"\",CONCATENATE($H$4,\" \",$Z18))","v":{"$error":"#VALUE!"}},{"$f":"IF($AA$3=\"\",\"\",表紙!$B$3)","v":{"$error":"#VALUE!"}},{"$f":"IF($AA$3=\"\",\"\",CONCATENATE(\"指導者\",\" \",表紙!$B$4))","v":{"$error":"#VALUE!"}},{"$f":"IF(AA18=\"\",\"\",0)","v":""}]
[17,{"$nulls":3},"Dチーム2区",{"$nulls":5},"","","","","","","","",3,"","",{"$f":"IF(U19=\"\",\"\",L19)","v":""},"",{"$f":"IF(W19=\"\",\"\",O19)","v":""},""]
[18,{"$nulls":3},"Dチーム3区",{"$nulls":5},"","","","","","","","",3,"","",{"$f":"IF(U20=\"\",\"\",L20)","v":""},"",{"$f":"IF(W20=\"\",\"\",O20)","v":""},""]
[19,{"$nulls":3},"Dチーム4区",{"$nulls":5},"","",{"$f":"IF($C21=\"\",\"\",D21)","v":""},{"$f":"IF($C21=\"\",\"\",1)","v":""},{"$f":"IF($C21=\"\",\"\",10)","v":""},{"$f":"IF($C21=\"\",\"\",$H$2)","v":""},{"$f":"IF($C21=\"\",\"\",K21)","v":""},"",3,"","",{"$f":"IF(U21=\"\",\"\",L21)","v":""},"",{"$f":"IF(W21=\"\",\"\",O21)","v":""},""]
[20,{"$nulls":3},"Dチーム5区",{"$nulls":5},"","",{"$f":"IF($C22=\"\",\"\",D22)","v":""},"","","",{"$f":"IF($C22=\"\",\"\",K22)","v":""},"",3,"","",{"$f":"IF(U22=\"\",\"\",L22)","v":""},"",{"$f":"IF(W22=\"\",\"\",O22)","v":""},""]
[21,{"$nulls":3},"Eチーム1区",{"$nulls":5},"","","","","","","","",4,"","",{"$f":"IF(U23=\"\",\"\",L23)","v":""},"",{"$f":"IF(W23=\"\",\"\",O23)","v":""},"","E",{"$f":"IF(T23=\"\",\"\",T23)","v":""},{"$f":"IF($AA$3=\"\",\"\",CONCATENATE($H$4,\" \",$Z23))","v":{"$error":"#VALUE!"}},{"$f":"IF($AA$3=\"\",\"\",表紙!$B$3)","v":{"$error":"#VALUE!"}},{"$f":"IF($AA$3=\"\",\"\",CONCATENATE(\"指導者\",\" \",表紙!$B$4))","v":{"$error":"#VALUE!"}},{"$f":"IF(AA23=\"\",\"\",0)","v":""}]
[22,{"$nulls":3},"Eチーム2区",{"$nulls":5},"","","","","","","","",4,"","",{"$f":"IF(U24=\"\",\"\",L24)","v":""},"",{"$f":"IF(W24=\"\",\"\",O24)","v":""},""]
[23,{"$nulls":3},"Eチーム3区",{"$nulls":5},"","","","","","","","",4,"","",{"$f":"IF(U25=\"\",\"\",L25)","v":""},"",{"$f":"IF(W25=\"\",\"\",O25)","v":""},""]
[24,{"$nulls":3},"Eチーム4区",{"$nulls":5},"","","","","","","","",4,"","",{"$f":"IF(U26=\"\",\"\",L26)","v":""},"",{"$f":"IF(W26=\"\",\"\",O26)","v":""},""]
[25,{"$nulls":3},"Eチーム5区",{"$nulls":5},"","",{"$f":"IF($C27=\"\",\"\",D27)","v":""},{"$f":"IF($C27=\"\",\"\",1)","v":""},{"$f":"IF($C27=\"\",\"\",10)","v":""},{"$f":"IF($C27=\"\",\"\",$H$2)","v":""},{"$f":"IF($C27=\"\",\"\",K27)","v":""},"",4,"","",{"$f":"IF(U27=\"\",\"\",L27)","v":""},"",{"$f":"IF(W27=\"\",\"\",O27)","v":""},""]
[26,null,"補員1","補員1","A補員",{"$nulls":5},{"$error":"#VALUE!"},"補員1()",{"$f":"IF($C28=\"\",\"\",D28)","v":"補員1"},1,10,"",{"$f":"IF($C28=\"\",\"\",K28)","v":{"$error":"#VALUE!"}},{"$f":"IF(C28=\"\",\"\",表紙!$I$9&\"8\")","v":"R00608"},{"$nulls":5},{"$f":"IF(W28=\"\",\"\",O28)","v":""},""]
[27,{"$nulls":3},"B補員",{"$nulls":5},"","","","","","","",{"$f":"IF(C29=\"\",\"\",表紙!$I$9&\"8\")","v":""},{"$nulls":5},{"$f":"IF(W29=\"\",\"\",O29)","v":""},""]
[28,{"$nulls":3},"C補員",{"$nulls":5},"","","","","","","",{"$f":"IF(C30=\"\",\"\",表紙!$I$9&\"8\")","v":""},{"$nulls":5},{"$f":"IF(W30=\"\",\"\",O30)","v":""},""]
[29,{"$nulls":3},"D補員",{"$nulls":5},"","","","","","","",{"$f":"IF(C31=\"\",\"\",表紙!$I$9&\"8\")","v":""},{"$nulls":5},{"$f":"IF(W31=\"\",\"\",O31)","v":""},""]
[30,{"$nulls":3},"E補員",{"$nulls":5},"","","","","","","",{"$f":"IF(C32=\"\",\"\",表紙!$I$9&\"8\")","v":""},{"$nulls":5},{"$f":"IF(W32=\"\",\"\",O32)","v":""},""]

{"sheet":"34女","index":3,"n_rows":32,"n_cols":31,"rows_kept":32}
[null,{"$f":"表紙!A1","v":2021},"年度　ライスカップ　３４年女子　入力欄",{"$nulls":7},"マスター系CSV作成",{"$nulls":8},"メンバー系CSV作成",{"$nulls":6},"チーム系CSV作成"]
["No.","学年","名前","フリガナ（半角カナ）","担当",null,"クラブコード",{"$f":"表紙!H3","v":""},null,null,"DB","N1","N2","SX","KC","MC","ZK","s1",null,"TM","DB","N1","N2","KC","MC",null,"ZK","N1","N2","N3","OP"]
[1,null,"Aチーム1区","Aチーム1区","Aチーム1区",null,"ゼッケン初期値",{"$f":"表紙!H4","v":""},null,null,{"$f":"IF($D3=\"\",\"\",B3*100000000+$H$5+$H$6+$A3)","v":{"$error":"#VALUE!"}},{"$f":"IF($C3=\"\",\"\",CONCATENATE(C3,\"(\",B3,\")\",))","v":"Aチーム1区()"},{"$f":"IF($C3=\"\",\"\",D3)","v":"Aチーム1区"},{"$f":"IF($C3=\"\",\"\",2)","v":2},{"$f":"IF($C3=\"\",\"\",10)","v":10},{"$f":"IF($C3=\"\",\"\",$H$2)","v":""},{"$f":"IF($C3=\"\",\"\",K3)","v":{"$error":"#VALUE!"}},{"$f":"IF(C3=\"\",\"\",CONCATENATE(\"R17208\"))","v":"R17208"},0,{"$f":"IF(K3=\"\",\"\",$H$2*10+S3)","v":{"$error":"#VALUE!"}},{"$f":"IF(K3=\"\",\"\",K3)","v":{"$error":"#VALUE!"}},{"$f":"IF(U3=\"\",\"\",L3)","v":{"$error":"#VALUE!"}},{"$f":"IF(V3=\"\",\"\",M3)","v":{"$error":"#VALUE!"}},{"$f":"IF(W3=\"\",\"\",O3)","v":{"$error":"#VALUE!"}},{"$f":"IF(X3=\"\",\"\",P3)","v":{"$error":"#VALUE!"}},"A",{"$f":"IF(T3=\"\",\"\",T3)","v":{"$error":"#VALUE!"}},{"$f":"IF($AA$3=\"\",\"\",CONCATENATE($H$4,\" \",$Z3))","v":{"$error":"#VALUE!"}},{"$f":"IF($AA$3=\"\",\"\",表紙!$B$3)","v":{"$error":"#VALUE!"}},{"$f":"IF($AA$3=\"\",\"\",CONCATENATE(\"指導者\",\" \",表紙!$B$4))","v":{"$error":"#VALUE!"}},{"$f":"IF(AA3=\"\",\"\",0)","v":{"$error":"#VALUE!"}}]
[2,null,"Aチーム2区","Aチーム2区","Aチーム2区",null,"クラブ略称",{"$f":"表紙!H5","v":""},null,null,{"$f":"IF($D4=\"\",\"\",B4*100000000+$H$5+$H$6+$A4)","v":{"$error":"#VALUE!"}},{"$f":"IF($C4=\"\",\"\",CONCATENATE(C4,\"(\",B4,\")\",))","v":"Aチーム2区()"},{"$f":"IF($C4=\"\",\"\",D4)","v":"Aチーム2区"},{"$f":"IF($C4=\"\",\"\",2)","v":2},{"$f":"IF($C4=\"\",\"\",10)","v":10},{"$f":"IF($C4=\"\",\"\",$H$2)","v":""},{"$f":"IF($C4=\"\",\"\",K4)","v":{"$error":"#VALUE!"}},"R17208",0,{"$f":"IF(K4=\"\",\"\",$H$2*10+S4)","v":{"$error":"#VALUE!"}},{"$f":"IF(K4=\"\",\"\",K4)","v":{"$error":"#VALUE!"}},{"$f":"IF(U4=\"\",\"\",L4)","v":{"$error":"#VALUE!"}},{"$error":"#VALUE!"},{"$f":"IF(W4=\"\",\"\",O4)","v":{"$error":"#VALUE!"}},{"$error":"#VALUE!"}]
[3,null,"Aチーム3区","Aチーム3区","Aチーム3区",null,"DB初期値",{"$f":"表紙!H6","v":""},null,null,{"$error":"#VALUE!"},"Aチーム3区()","Aチーム3区",2,10,"",{"$error":"#VALUE!"},"R17208",0,{"$error":"#VALUE!"},{"$error":"#VALUE!"},{"$error":"#VALUE!"},{"$error":"#VALUE!"},{"$error":"#VALUE!"},{"$error":"#VALUE!"}]
[4,null,"Aチーム4区","Aチーム4区","Aチーム4区",null,"種目固有数",300,null,null,{"$error":"#VALUE!"},"Aチーム4区()","Aチーム4区",2,10,"",{"$error":"#VALUE!"},"R17208",0,{"$error":"#VALUE!"},{"$error":"#VALUE!"},{"$error":"#VALUE!"},{"$error":"#VALUE!"},{"$error":"#VALUE!"},{"$error":"#VALUE!"}]
[5,null,"Aチーム5区","Aチーム5区","Aチーム5区",null,"学年",3,null,null,{"$error":"#VALUE!"},"Aチーム5区()","Aチーム5区",2,10,"",{"$error":"#VALUE!"},"R17208",0,{"$error":"#VALUE!"},{"$error":"#VALUE!"},{"$error":"#VALUE!"},{"$error":"#VALUE!"},{"$error":"#VALUE!"},{"$error":"#VALUE!"}]
[6,{"$nulls":3},"Bチーム1区",null,null,4,null,null,"","","","","","","","",1,"","","","","","","B",{"$f":"IF(T8=\"\",\"\",T8)","v":""},{"$f":"IF($AA$3=\"\",\"\",CONCATENATE($H$4,\" \",$Z8))","v":{"$error":"#VALUE!"}},{"$f":"IF($AA$3=\"\",\"\",表紙!$B$3)","v":{"$error":"#VALUE!"}},{"$f":"IF($AA$3=\"\",\"\",CONCATENATE(\"指導者\",\" \",表紙!$B$4))","v":{"$error":"#VALUE!"}},{"$f":"IF(AA8=\"\",\"\",0)","v":""}]
[7,{"$nulls":3},"Bチーム2区",{"$nulls":5},"","",{"$f":"IF($C9=\"\",\"\",D9)","v":""},"",{"$f":"IF($C9=\"\",\"\",10)","v":""},{"$f":"IF($C9=\"\",\"\",$H$2)","v":""},{"$f":"IF($C9=\"\",\"\",K9)","v":""},"",1,"","","","","",""]
[8,{"$nulls":3},"Bチーム3区",null,"性別","男",null,null,"","",{"$f":"IF($C10=\"\",\"\",D10)","v":""},"","","",{"$f":"IF($C10=\"\",\"\",K10)","v":""},"",1,"","","","","",""]
[9,{"$nulls":3},"Bチーム4区",null,null,"女",null,null,"","","","","","","","",1,"","","","","",""]
[10,{"$nulls":3},"Bチーム5区",{"$nulls":5},"","","","","","","","",1,"","","","","",""]
[11,{"$nulls":3},"Cチーム1区",{"$nulls":5},"","","","","","","","",2,"","","","","","","C",{"$f":"IF(T13=\"\",\"\",T13)","v":""},{"$f":"IF($AA$3=\"\",\"\",CONCATENATE($H$4,\" \",$Z13))","v":{"$error":"#VALUE!"}},{"$f":"IF($AA$3=\"\",\"\",表紙!$B$3)","v":{"$error":"#VALUE!"}},{"$f":"IF($AA$3=\"\",\"\",CONCATENATE(\"指導者\",\" \",表紙!$B$4))","v":{"$error":"#VALUE!"}},{"$f":"IF(AA13=\"\",\"\",0)","v":""}]
[12,{"$nulls":3},"Cチーム2区",{"$nulls":5},"","","","","","","","",2,"","","","","",""]
[13,{"$nulls":3},"Cチーム3区",{"$nulls":5},"","",{"$f":"IF($C15=\"\",\"\",D15)","v":""},"",{"$f":"IF($C15=\"\",\"\",10)","v":""},{"$f":"IF($C15=\"\",\"\",$H$2)","v":""},{"$f":"IF($C15=\"\",\"\",K15)","v":""},"",2,"","","","","",""]
[14,{"$nulls":3},"Cチーム4区",{"$nulls":5},"","",{"$f":"IF($C16=\"\",\"\",D16)","v":""},"","","",{"$f":"IF($C16=\"\",\"\",K16)","v":""},"",2,"","","","","",""]
[15,{"$nulls":3},"Cチーム5区",{"$nulls":5},"","","","","","","","",2,"","","","","",""]
[16,{"$nulls":3},"Dチーム1区",{"$nulls":5},"","","","","","","","",3,"","","","","","","D",{"$f":"IF(T18=\"\",\"\",T18)","v":""},{"$f":"IF($AA$3=\"\",\"\",CONCATENATE($H$4,\" \",$Z18))","v":{"$error":"#VALUE!"}},{"$f":"IF($AA$3=\"\",\"\",表紙!$B$3)","v":{"$error":"#VALUE!"}},{"$f":"IF($AA$3=\"\",\"\",CONCATENATE(\"指導者\",\" \",表紙!$B$4))","v":{"$error":"#VALUE!"}},{"$f":"IF(AA18=\"\",\"\",0)","v":""}]
[17,{"$nulls":3},"Dチーム2区",{"$nulls":5},"","","","","","","","",3,"","","","","",""]
[18,{"$nulls":3},"Dチーム3区",{"$nulls":5},"","","","","","","","",3,"","",{"$f":"IF(U20=\"\",\"\",L20)","v":""},"",{"$f":"IF(W20=\"\",\"\",O20)","v":""},""]
[19,{"$nulls":3},"Dチーム4区",{"$nulls":5},"","",{"$f":"IF($C21=\"\",\"\",D21)","v":""},"",{"$f":"IF($C21=\"\",\"\",10)","v":""},{"$f":"IF($C21=\"\",\"\",$H$2)","v":""},{"$f":"IF($C21=\"\",\"\",K21)","v":""},"",3,"","","","","",""]
[20,{"$nulls":3},"Dチーム5区",{"$nulls":5},"","",{"$f":"IF($C22=\"\",\"\",D22)","v":""},"","","",{"$f":"IF($C22=\"\",\"\",K22)","v":""},"",3,"","","","","",""]
[21,{"$nulls":3},"Eチーム1区",{"$nulls":5},"","","","","","","","",4,"","","","","","","E",{"$f":"IF(T23=\"\",\"\",T23)","v":""},{"$f":"IF($AA$3=\"\",\"\",CONCATENATE($H$4,\" \",$Z23))","v":{"$error":"#VALUE!"}},{"$f":"IF($AA$3=\"\",\"\",表紙!$B$3)","v":{"$error":"#VALUE!"}},{"$f":"IF($AA$3=\"\",\"\",CONCATENATE(\"指導者\",\" \",表紙!$B$4))","v":{"$error":"#VALUE!"}},{"$f":"IF(AA23=\"\",\"\",0)","v":""}]
[22,{"$nulls":3},"Eチーム2区",{"$nulls":5},"","","","","","","","",4,"","","","","",""]
[23,{"$nulls":3},"Eチーム3区",{"$nulls":5},"","","","","","","","",4,"","","","","",""]
[24,{"$nulls":3},"Eチーム4区",{"$nulls":5},"","","","","","","","",4,"","","","","",""]
[25,{"$nulls":3},"Eチーム5区",{"$nulls":5},"","",{"$f":"IF($C27=\"\",\"\",D27)","v":""},"",{"$f":"IF($C27=\"\",\"\",10)","v":""},{"$f":"IF($C27=\"\",\"\",$H$2)","v":""},{"$f":"IF($C27=\"\",\"\",K27)","v":""},{"$f":"IF(C27=\"\",\"\",CONCATENATE(\"R17208\"))","v":""},4,"","","","","",""]
[26,null,"補員1","補員1","A補員",{"$nulls":5},{"$error":"#VALUE!"},"補員1()",{"$f":"IF($C28=\"\",\"\",D28)","v":"補員1"},2,10,"",{"$f":"IF($C28=\"\",\"\",K28)","v":{"$error":"#VALUE!"}},{"$f":"IF(C28=\"\",\"\",表紙!$I$9&\"8\")","v":"R00608"},{"$nulls":5},"",""]
[27,{"$nulls":3},"B補員",{"$nulls":5},"","","","","","","",{"$f":"IF(C29=\"\",\"\",表紙!$I$9&\"8\")","v":""},{"$nulls":5},"",""]
[28,{"$nulls":3},"C補員",{"$nulls":5},"","","","","","","",{"$f":"IF(C30=\"\",\"\",表紙!$I$9&\"8\")","v":""},{"$nulls":5},"",""]
[29,{"$nulls":3},"D補員",{"$nulls":5},"","","","","","","",{"$f":"IF(C31=\"\",\"\",表紙!$I$9&\"8\")","v":""},{"$nulls":5},"",""]
[30,{"$nulls":3},"E補員",{"$nulls":5},"","","","","","","",{"$f":"IF(C32=\"\",\"\",表紙!$I$9&\"8\")","v":""},{"$nulls":5},"",""]

{"sheet":"56男","index":4,"n_rows":32,"n_cols":31,"rows_kept":32}
[null,{"$f":"表紙!A1","v":2021},"年度　ライスカップ　５６年男子　入力欄",{"$nulls":7},"マスター系CSV作成",{"$nulls":8},"メンバー系CSV作成",{"$nulls":6},"チーム系CSV作成"]
["No.","学年","名前","フリガナ（半角カナ）","担当",null,"クラブコード",{"$f":"表紙!H3","v":""},null,null,"DB","N1","N2","SX","KC","MC","ZK","s1",null,"TM","DB","N1","N2","KC","MC",null,"ZK","N1","N2","N3","OP"]
[1,null,"Aチーム1区","Aチーム1区","Aチーム1区",null,"ゼッケン初期値",{"$f":"表紙!H4","v":""},null,null,{"$f":"IF($D3=\"\",\"\",B3*100000000+$H$5+$H$6+$A3)","v":{"$error":"#VALUE!"}},{"$f":"IF($C3=\"\",\"\",CONCATENATE(C3,\"(\",B3,\")\",))","v":"Aチーム1区()"},{"$f":"IF($C3=\"\",\"\",D3)","v":"Aチーム1区"},{"$f":"IF($C3=\"\",\"\",1)","v":1},{"$f":"IF($C3=\"\",\"\",10)","v":10},{"$f":"IF($C3=\"\",\"\",$H$2)","v":""},{"$f":"IF($C3=\"\",\"\",K3)","v":{"$error":"#VALUE!"}},{"$f":"IF(C3=\"\",\"\",CONCATENATE(\"R17209\"))","v":"R17209"},0,{"$f":"IF(K3=\"\",\"\",$H$2*10+S3)","v":{"$error":"#VALUE!"}},{"$f":"IF(K3=\"\",\"\",K3)","v":{"$error":"#VALUE!"}},{"$f":"IF(U3=\"\",\"\",L3)","v":{"$error":"#VALUE!"}},{"$f":"IF(V3=\"\",\"\",M3)","v":{"$error":"#VALUE!"}},{"$f":"IF(W3=\"\",\"\",O3)","v":{"$error":"#VALUE!"}},{"$f":"IF(X3=\"\",\"\",P3)","v":{"$error":"#VALUE!"}},"A",{"$f":"IF(T3=\"\",\"\",T3)","v":{"$error":"#VALUE!"}},{"$f":"IF($AA$3=\"\",\"\",CONCATENATE($H$4,\" \",$Z3))","v":{"$error":"#VALUE!"}},{"$f":"IF($AA$3=\"\",\"\",表紙!$B$3)","v":{"$error":"#VALUE!"}},{"$f":"IF($AA$3=\"\",\"\",CONCATENATE(\"指導者\",\" \",表紙!$B$4))","v":{"$error":"#VALUE!"}},{"$f":"IF(AA3=\"\",\"\",0)","v":{"$error":"#VALUE!"}}]
[2,null,"Aチーム2区","Aチーム2区","Aチーム2区",null,"クラブ略称",{"$f":"表紙!H5","v":""},null,null,{"$f":"IF($D4=\"\",\"\",B4*100000000+$H$5+$H$6+$A4)","v":{"$error":"#VALUE!"}},{"$f":"IF($C4=\"\",\"\",CONCATENATE(C4,\"(\",B4,\")\",))","v":"Aチーム2区()"},{"$f":"IF($C4=\"\",\"\",D4)","v":"Aチーム2区"},{"$f":"IF($C4=\"\",\"\",1)","v":1},{"$f":"IF($C4=\"\",\"\",10)","v":10},{"$f":"IF($C4=\"\",\"\",$H$2)","v":""},{"$f":"IF($C4=\"\",\"\",K4)","v":{"$error":"#VALUE!"}},"R17209",0,{"$f":"IF(K4=\"\",\"\",$H$2*10+S4)","v":{"$error":"#VALUE!"}},{"$f":"IF(K4=\"\",\"\",K4)","v":{"$error":"#VALUE!"}},{"$f":"IF(U4=\"\",\"\",L4)","v":{"$error":"#VALUE!"}},{"$error":"#VALUE!"},{"$f":"IF(W4=\"\",\"\",O4)","v":{"$error":"#VALUE!"}},{"$error":"#VALUE!"}]
[3,null,"Aチーム3区","Aチーム3区","Aチーム3区",null,"DB初期値",{"$f":"表紙!H6","v":""},null,null,{"$error":"#VALUE!"},"Aチーム3区()","Aチーム3区",1,10,"",{"$error":"#VALUE!"},"R17209",0,{"$error":"#VALUE!"},{"$error":"#VALUE!"},{"$error":"#VALUE!"},{"$error":"#VALUE!"},{"$error":"#VALUE!"},{"$error":"#VALUE!"}]
[4,null,"Aチーム4区","Aチーム4区","Aチーム4区",null,"種目固有数",400,null,null,{"$error":"#VALUE!"},"Aチーム4区()","Aチーム4区",1,10,"",{"$error":"#VALUE!"},"R17209",0,{"$error":"#VALUE!"},{"$error":"#VALUE!"},{"$error":"#VALUE!"},{"$error":"#VALUE!"},{"$error":"#VALUE!"},{"$error":"#VALUE!"}]
[5,null,"Aチーム5区","Aチーム5区","Aチーム5区",null,"学年",5,null,null,{"$error":"#VALUE!"},"Aチーム5区()","Aチーム5区",1,10,"",{"$error":"#VALUE!"},"R17209",0,{"$error":"#VALUE!"},{"$error":"#VALUE!"},{"$error":"#VALUE!"},{"$error":"#VALUE!"},{"$error":"#VALUE!"},{"$error":"#VALUE!"}]
[6,null,"Bチーム1区","Bチーム1区","Bチーム1区",null,null,6,null,null,{"$error":"#VALUE!"},"Bチーム1区()","Bチーム1区",1,10,"",{"$error":"#VALUE!"},"R17209",1,{"$error":"#VALUE!"},{"$error":"#VALUE!"},{"$error":"#VALUE!"},{"$error":"#VALUE!"},{"$error":"#VALUE!"},{"$error":"#VALUE!"},"B",{"$f":"IF(T8=\"\",\"\",T8)","v":{"$error":"#VALUE!"}},{"$f":"IF($AA$3=\"\",\"\",CONCATENATE($H$4,\" \",$Z8))","v":{"$error":"#VALUE!"}},{"$f":"IF($AA$3=\"\",\"\",表紙!$B$3)","v":{"$error":"#VALUE!"}},{"$f":"IF($AA$3=\"\",\"\",CONCATENATE(\"指導者\",\" \",表紙!$B$4))","v":{"$error":"#VALUE!"}},{"$f":"IF(AA8=\"\",\"\",0)","v":{"$error":"#VALUE!"}}]
[7,null,"Bチーム2区","Bチーム2区","Bチーム2区",{"$nulls":5},{"$error":"#VALUE!"},"Bチーム2区()",{"$f":"IF($C9=\"\",\"\",D9)","v":"Bチーム2区"},{"$f":"IF($C9=\"\",\"\",1)","v":1},{"$f":"IF($C9=\"\",\"\",10)","v":10},{"$f":"IF($C9=\"\",\"\",$H$2)","v":""},{"$f":"IF($C9=\"\",\"\",K9)","v":{"$error":"#VALUE!"}},"R17209",1,{"$error":"#VALUE!"},{"$error":"#VALUE!"},{"$error":"#VALUE!"},{"$error":"#VALUE!"},{"$error":"#VALUE!"},{"$error":"#VALUE!"}]
[8,null,"Bチーム3区","Bチーム3区","Bチーム3区",null,"性別","男",null,null,{"$error":"#VALUE!"},"Bチーム3区()",{"$f":"IF($C10=\"\",\"\",D10)","v":"Bチーム3区"},1,10,"",{"$f":"IF($C10=\"\",\"\",K10)","v":{"$error":"#VALUE!"}},"R17209",1,{"$error":"#VALUE!"},{"$error":"#VALUE!"},{"$error":"#VALUE!"},{"$error":"#VALUE!"},{"$error":"#VALUE!"},{"$error":"#VALUE!"}]
[9,null,"Bチーム4区","Bチーム4区","Bチーム4区",null,null,"女",null,null,{"$error":"#VALUE!"},"Bチーム4区()","Bチーム4区",1,10,"",{"$error":"#VALUE!"},"R17209",1,{"$error":"#VALUE!"},{"$error":"#VALUE!"},{"$error":"#VALUE!"},{"$error":"#VALUE!"},{"$error":"#VALUE!"},{"$error":"#VALUE!"}]
[10,null,"Bチーム5区","Bチーム5区","Bチーム5区",{"$nulls":5},{"$error":"#VALUE!"},"Bチーム5区()","Bチーム5区",1,10,"",{"$error":"#VALUE!"},"R17209",1,{"$error":"#VALUE!"},{"$error":"#VALUE!"},{"$error":"#VALUE!"},{"$error":"#VALUE!"},{"$error":"#VALUE!"},{"$error":"#VALUE!"}]
[11,{"$nulls":3},"Cチーム1区",{"$nulls":5},"","","","","","","","",2,"","","","","","","C",{"$f":"IF(T13=\"\",\"\",T13)","v":""},{"$f":"IF($AA$3=\"\",\"\",CONCATENATE($H$4,\" \",$Z13))","v":{"$error":"#VALUE!"}},{"$f":"IF($AA$3=\"\",\"\",表紙!$B$3)","v":{"$error":"#VALUE!"}},{"$f":"IF($AA$3=\"\",\"\",CONCATENATE(\"指導者\",\" \",表紙!$B$4))","v":{"$error":"#VALUE!"}},{"$f":"IF(AA13=\"\",\"\",0)","v":""}]
[12,{"$nulls":3},"Cチーム2区",{"$nulls":5},"","","","","","","","",2,"","","","","",""]
[13,{"$nulls":3},"Cチーム3区",{"$nulls":5},"","",{"$f":"IF($C15=\"\",\"\",D15)","v":""},{"$f":"IF($C15=\"\",\"\",1)","v":""},{"$f":"IF($C15=\"\",\"\",10)","v":""},{"$f":"IF($C15=\"\",\"\",$H$2)","v":""},{"$f":"IF($C15=\"\",\"\",K15)","v":""},"",2,"","","","","",""]
[14,{"$nulls":3},"Cチーム4区",{"$nulls":5},"","",{"$f":"IF($C16=\"\",\"\",D16)","v":""},"","","",{"$f":"IF($C16=\"\",\"\",K16)","v":""},"",2,"","","","","",""]
[15,{"$nulls":3},"Cチーム5区",{"$nulls":5},"","","","","","","","",2,"","","","","",""]
[16,{"$nulls":3},"Dチーム1区",{"$nulls":5},"","","","","","","","",3,"","","","","","","D",{"$f":"IF(T18=\"\",\"\",T18)","v":""},{"$f":"IF($AA$3=\"\",\"\",CONCATENATE($H$4,\" \",$Z18))","v":{"$error":"#VALUE!"}},{"$f":"IF($AA$3=\"\",\"\",表紙!$B$3)","v":{"$error":"#VALUE!"}},{"$f":"IF($AA$3=\"\",\"\",CONCATENATE(\"指導者\",\" \",表紙!$B$4))","v":{"$error":"#VALUE!"}},{"$f":"IF(AA18=\"\",\"\",0)","v":""}]
[17,{"$nulls":3},"Dチーム2区",{"$nulls":5},"","","","","","","","",3,"","","","","",""]
[18,{"$nulls":3},"Dチーム3区",{"$nulls":5},"","","","","","","","",3,"","",{"$f":"IF(U20=\"\",\"\",L20)","v":""},"",{"$f":"IF(W20=\"\",\"\",O20)","v":""},""]
[19,{"$nulls":3},"Dチーム4区",{"$nulls":5},"","",{"$f":"IF($C21=\"\",\"\",D21)","v":""},{"$f":"IF($C21=\"\",\"\",1)","v":""},{"$f":"IF($C21=\"\",\"\",10)","v":""},{"$f":"IF($C21=\"\",\"\",$H$2)","v":""},{"$f":"IF($C21=\"\",\"\",K21)","v":""},"",3,"","","","","",""]
[20,{"$nulls":3},"Dチーム5区",{"$nulls":5},"","",{"$f":"IF($C22=\"\",\"\",D22)","v":""},"","","",{"$f":"IF($C22=\"\",\"\",K22)","v":""},"",3,"","","","","",""]
[21,{"$nulls":3},"Eチーム1区",{"$nulls":5},"","","","","","","","",4,"","","","","","","E",{"$f":"IF(T23=\"\",\"\",T23)","v":""},{"$f":"IF($AA$3=\"\",\"\",CONCATENATE($H$4,\" \",$Z23))","v":{"$error":"#VALUE!"}},{"$f":"IF($AA$3=\"\",\"\",表紙!$B$3)","v":{"$error":"#VALUE!"}},{"$f":"IF($AA$3=\"\",\"\",CONCATENATE(\"指導者\",\" \",表紙!$B$4))","v":{"$error":"#VALUE!"}},{"$f":"IF(AA23=\"\",\"\",0)","v":""}]
[22,{"$nulls":3},"Eチーム2区",{"$nulls":5},"","","","","","","","",4,"","","","","",""]
[23,{"$nulls":3},"Eチーム3区",{"$nulls":5},"","","","","","","","",4,"","","","","",""]
[24,{"$nulls":3},"Eチーム4区",{"$nulls":5},"","","","","","","","",4,"","","","","",""]
[25,{"$nulls":3},"Eチーム5区",{"$nulls":5},"","",{"$f":"IF($C27=\"\",\"\",D27)","v":""},{"$f":"IF($C27=\"\",\"\",1)","v":""},{"$f":"IF($C27=\"\",\"\",10)","v":""},{"$f":"IF($C27=\"\",\"\",$H$2)","v":""},{"$f":"IF($C27=\"\",\"\",K27)","v":""},"",4,"","","","","",""]
[26,null,"Aチーム補員","Aチーム補員","A補員",{"$nulls":5},{"$error":"#VALUE!"},"Aチーム補員()",{"$f":"IF($C28=\"\",\"\",D28)","v":"Aチーム補員"},1,10,"",{"$f":"IF($C28=\"\",\"\",K28)","v":{"$error":"#VALUE!"}},{"$f":"IF(C28=\"\",\"\",表紙!$I$10&\"9\")","v":"R00609"},{"$nulls":5},"",""]
[27,null,"Bチーム補員","Bチーム補員","B補員",{"$nulls":5},{"$error":"#VALUE!"},"Bチーム補員()","Bチーム補員",1,10,"",{"$error":"#VALUE!"},{"$f":"IF(C29=\"\",\"\",表紙!$I$10&\"9\")","v":"R00609"},{"$nulls":5},"",""]
[28,{"$nulls":3},"C補員",{"$nulls":5},"","","","","","","",{"$f":"IF(C30=\"\",\"\",表紙!$I$10&\"9\")","v":""},{"$nulls":5},"",""]
[29,{"$nulls":3},"D補員",{"$nulls":5},"","","","","","","",{"$f":"IF(C31=\"\",\"\",表紙!$I$10&\"9\")","v":""},{"$nulls":5},"",""]
[30,{"$nulls":3},"E補員",{"$nulls":5},"","","","","","","",{"$f":"IF(C32=\"\",\"\",表紙!$I$10&\"9\")","v":""},{"$nulls":5},"",""]

{"sheet":"56女","index":5,"n_rows":32,"n_cols":31,"rows_kept":32}
[null,{"$f":"表紙!A1","v":2021},"年度　ライスカップ　５６年女子　入力欄",{"$nulls":7},"マスター系CSV作成",{"$nulls":8},"メンバー系CSV作成",{"$nulls":6},"チーム系CSV作成"]
["No.","学年","名前","フリガナ（半角カナ）","担当",null,"クラブコード",{"$f":"表紙!H3","v":""},null,null,"DB","N1","N2","SX","KC","MC","ZK","s1",null,"TM","DB","N1","N2","KC","MC",null,"ZK","N1","N2","N3","OP"]
[1,null,"Aチーム1区","Aチーム1区","Aチーム1区",null,"ゼッケン初期値",{"$f":"表紙!H4","v":""},null,null,{"$f":"IF($D3=\"\",\"\",B3*100000000+$H$5+$H$6+$A3)","v":{"$error":"#VALUE!"}},{"$f":"IF($C3=\"\",\"\",CONCATENATE(C3,\"(\",B3,\")\",))","v":"Aチーム1区()"},{"$f":"IF($C3=\"\",\"\",D3)","v":"Aチーム1区"},{"$f":"IF($C3=\"\",\"\",2)","v":2},{"$f":"IF($C3=\"\",\"\",10)","v":10},{"$f":"IF($C3=\"\",\"\",$H$2)","v":""},{"$f":"IF($C3=\"\",\"\",K3)","v":{"$error":"#VALUE!"}},{"$f":"IF(C3=\"\",\"\",CONCATENATE(\"R17209\"))","v":"R17209"},0,{"$f":"IF(K3=\"\",\"\",$H$2*10+S3)","v":{"$error":"#VALUE!"}},{"$f":"IF(K3=\"\",\"\",K3)","v":{"$error":"#VALUE!"}},{"$f":"IF(U3=\"\",\"\",L3)","v":{"$error":"#VALUE!"}},{"$f":"IF(V3=\"\",\"\",M3)","v":{"$error":"#VALUE!"}},{"$f":"IF(W3=\"\",\"\",O3)","v":{"$error":"#VALUE!"}},{"$f":"IF(X3=\"\",\"\",P3)","v":{"$error":"#VALUE!"}},"A",{"$f":"IF(T3=\"\",\"\",T3)","v":{"$error":"#VALUE!"}},{"$f":"IF($AA$3=\"\",\"\",CONCATENATE($H$4,\" \",$Z3))","v":{"$error":"#VALUE!"}},{"$f":"IF($AA$3=\"\",\"\",表紙!$B$3)","v":{"$error":"#VALUE!"}},{"$f":"IF($AA$3=\"\",\"\",CONCATENATE(\"指導者\",\" \",表紙!$B$4))","v":{"$error":"#VALUE!"}},{"$f":"IF(AA3=\"\",\"\",0)","v":{"$error":"#VALUE!"}}]
[2,null,"Aチーム2区","Aチーム2区","Aチーム2区",null,"クラブ略称",{"$f":"表紙!H5","v":""},null,null,{"$f":"IF($D4=\"\",\"\",B4*100000000+$H$5+$H$6+$A4)","v":{"$error":"#VALUE!"}},{"$f":"IF($C4=\"\",\"\",CONCATENATE(C4,\"(\",B4,\")\",))","v":"Aチーム2区()"},{"$f":"IF($C4=\"\",\"\",D4)","v":"Aチーム2区"},{"$f":"IF($C4=\"\",\"\",2)","v":2},{"$f":"IF($C4=\"\",\"\",10)","v":10},{"$f":"IF($C4=\"\",\"\",$H$2)","v":""},{"$f":"IF($C4=\"\",\"\",K4)","v":{"$error":"#VALUE!"}},"R17209",0,{"$f":"IF(K4=\"\",\"\",$H$2*10+S4)","v":{"$error":"#VALUE!"}},{"$f":"IF(K4=\"\",\"\",K4)","v":{"$error":"#VALUE!"}},{"$f":"IF(U4=\"\",\"\",L4)","v":{"$error":"#VALUE!"}},{"$error":"#VALUE!"},{"$f":"IF(W4=\"\",\"\",O4)","v":{"$error":"#VALUE!"}},{"$error":"#VALUE!"}]
[3,null,"Aチーム3区","Aチーム3区","Aチーム3区",null,"DB初期値",{"$f":"表紙!H6","v":""},null,null,{"$error":"#VALUE!"},"Aチーム3区()","Aチーム3区",2,10,"",{"$error":"#VALUE!"},"R17209",0,{"$error":"#VALUE!"},{"$error":"#VALUE!"},{"$error":"#VALUE!"},{"$error":"#VALUE!"},{"$error":"#VALUE!"},{"$error":"#VALUE!"}]
[4,null,"Aチーム4区","Aチーム4区","Aチーム4区",null,"種目固有数",500,null,null,{"$error":"#VALUE!"},"Aチーム4区()","Aチーム4区",2,10,"",{"$error":"#VALUE!"},"R17209",0,{"$error":"#VALUE!"},{"$error":"#VALUE!"},{"$error":"#VALUE!"},{"$error":"#VALUE!"},{"$error":"#VALUE!"},{"$error":"#VALUE!"}]
[5,null,"Aチーム5区","Aチーム5区","Aチーム5区",null,"学年",5,null,null,{"$error":"#VALUE!"},"Aチーム5区()","Aチーム5区",2,10,"",{"$error":"#VALUE!"},"R17209",0,{"$error":"#VALUE!"},{"$error":"#VALUE!"},{"$error":"#VALUE!"},{"$error":"#VALUE!"},{"$error":"#VALUE!"},{"$error":"#VALUE!"}]
[6,null,"Bチーム1区","Bチーム1区","Bチーム1区",null,null,6,null,null,{"$error":"#VALUE!"},"Bチーム1区()","Bチーム1区",2,10,"",{"$error":"#VALUE!"},"R17209",1,{"$error":"#VALUE!"},{"$error":"#VALUE!"},{"$error":"#VALUE!"},{"$error":"#VALUE!"},{"$error":"#VALUE!"},{"$error":"#VALUE!"},"B",{"$f":"IF(T8=\"\",\"\",T8)","v":{"$error":"#VALUE!"}},{"$f":"IF($AA$3=\"\",\"\",CONCATENATE($H$4,\" \",$Z8))","v":{"$error":"#VALUE!"}},{"$f":"IF($AA$3=\"\",\"\",表紙!$B$3)","v":{"$error":"#VALUE!"}},{"$f":"IF($AA$3=\"\",\"\",CONCATENATE(\"指導者\",\" \",表紙!$B$4))","v":{"$error":"#VALUE!"}},{"$f":"IF(AA8=\"\",\"\",0)","v":{"$error":"#VALUE!"}}]
[7,null,"Bチーム2区","Bチーム2区","Bチーム2区",{"$nulls":5},{"$error":"#VALUE!"},"Bチーム2区()",{"$f":"IF($C9=\"\",\"\",D9)","v":"Bチーム2区"},2,{"$f":"IF($C9=\"\",\"\",10)","v":10},{"$f":"IF($C9=\"\",\"\",$H$2)","v":""},{"$f":"IF($C9=\"\",\"\",K9)","v":{"$error":"#VALUE!"}},"R17209",1,{"$error":"#VALUE!"},{"$error":"#VALUE!"},{"$error":"#VALUE!"},{"$error":"#VALUE!"},{"$error":"#VALUE!"},{"$error":"#VALUE!"}]
[8,null,"Bチーム3区","Bチーム3区","Bチーム3区",null,"性別","男",null,null,{"$error":"#VALUE!"},"Bチーム3区()",{"$f":"IF($C10=\"\",\"\",D10)","v":"Bチーム3区"},2,10,"",{"$f":"IF($C10=\"\",\"\",K10)","v":{"$error":"#VALUE!"}},"R17209",1,{"$error":"#VALUE!"},{"$error":"#VALUE!"},{"$error":"#VALUE!"},{"$error":"#VALUE!"},{"$error":"#VALUE!"},{"$error":"#VALUE!"}]
[9,null,"Bチーム4区","Bチーム4区","Bチーム4区",null,null,"女",null,null,{"$error":"#VALUE!"},"Bチーム4区()","Bチーム4区",2,10,"",{"$error":"#VALUE!"},"R17209",1,{"$error":"#VALUE!"},{"$error":"#VALUE!"},{"$error":"#VALUE!"},{"$error":"#VALUE!"},{"$error":"#VALUE!"},{"$error":"#VALUE!"}]
[10,null,"Bチーム5区","Bチーム5区","Bチーム5区",{"$nulls":5},{"$error":"#VALUE!"},"Bチーム5区()","Bチーム5区",2,10,"",{"$error":"#VALUE!"},"R17209",1,{"$error":"#VALUE!"},{"$error":"#VALUE!"},{"$error":"#VALUE!"},{"$error":"#VALUE!"},{"$error":"#VALUE!"},{"$error":"#VALUE!"}]
[11,{"$nulls":3},"Cチーム1区",{"$nulls":5},"","","","","","","","",2,"","","","","","","C",{"$f":"IF(T13=\"\",\"\",T13)","v":""},{"$f":"IF($AA$3=\"\",\"\",CONCATENATE($H$4,\" \",$Z13))","v":{"$error":"#VALUE!"}},{"$f":"IF($AA$3=\"\",\"\",表紙!$B$3)","v":{"$error":"#VALUE!"}},{"$f":"IF($AA$3=\"\",\"\",CONCATENATE(\"指導者\",\" \",表紙!$B$4))","v":{"$error":"#VALUE!"}},{"$f":"IF(AA13=\"\",\"\",0)","v":""}]
[12,{"$nulls":3},"Cチーム2区",{"$nulls":5},"","","","","","","","",2,"","","","","",""]
[13,{"$nulls":3},"Cチーム3区",{"$nulls":5},"","",{"$f":"IF($C15=\"\",\"\",D15)","v":""},"",{"$f":"IF($C15=\"\",\"\",10)","v":""},{"$f":"IF($C15=\"\",\"\",$H$2)","v":""},{"$f":"IF($C15=\"\",\"\",K15)","v":""},"",2,"","","","","",""]
[14,{"$nulls":3},"Cチーム4区",{"$nulls":5},"","",{"$f":"IF($C16=\"\",\"\",D16)","v":""},"","","",{"$f":"IF($C16=\"\",\"\",K16)","v":""},"",2,"","","","","",""]
[15,{"$nulls":3},"Cチーム5区",{"$nulls":5},"","","","","","","","",2,"","","","","",""]
[16,{"$nulls":3},"Dチーム1区",{"$nulls":5},"","","","","","","","",3,"","","","","","","D",{"$f":"IF(T18=\"\",\"\",T18)","v":""},{"$f":"IF($AA$3=\"\",\"\",CONCATENATE($H$4,\" \",$Z18))","v":{"$error":"#VALUE!"}},{"$f":"IF($AA$3=\"\",\"\",表紙!$B$3)","v":{"$error":"#VALUE!"}},{"$f":"IF($AA$3=\"\",\"\",CONCATENATE(\"指導者\",\" \",表紙!$B$4))","v":{"$error":"#VALUE!"}},{"$f":"IF(AA18=\"\",\"\",0)","v":""}]
[17,{"$nulls":3},"Dチーム2区",{"$nulls":5},"","","","","","","","",3,"","","","","",""]
[18,{"$nulls":3},"Dチーム3区",{"$nulls":5},"","","","","","","","",3,"","",{"$f":"IF(U20=\"\",\"\",L20)","v":""},"",{"$f":"IF(W20=\"\",\"\",O20)","v":""},""]
[19,{"$nulls":3},"Dチーム4区",{"$nulls":5},"","",{"$f":"IF($C21=\"\",\"\",D21)","v":""},"",{"$f":"IF($C21=\"\",\"\",10)","v":""},{"$f":"IF($C21=\"\",\"\",$H$2)","v":""},{"$f":"IF($C21=\"\",\"\",K21)","v":""},"",3,"","","","","",""]
[20,{"$nulls":3},"Dチーム5区",{"$nulls":5},"","",{"$f":"IF($C22=\"\",\"\",D22)","v":""},"","","",{"$f":"IF($C22=\"\",\"\",K22)","v":""},"",3,"","","","","",""]
[21,{"$nulls":3},"Eチーム1区",{"$nulls":5},"","","","","","","","",4,"","","","","","","E",{"$f":"IF(T23=\"\",\"\",T23)","v":""},{"$f":"IF($AA$3=\"\",\"\",CONCATENATE($H$4,\" \",$Z23))","v":{"$error":"#VALUE!"}},{"$f":"IF($AA$3=\"\",\"\",表紙!$B$3)","v":{"$error":"#VALUE!"}},{"$f":"IF($AA$3=\"\",\"\",CONCATENATE(\"指導者\",\" \",表紙!$B$4))","v":{"$error":"#VALUE!"}},{"$f":"IF(AA23=\"\",\"\",0)","v":""}]
[22,{"$nulls":3},"Eチーム2区",{"$nulls":5},"","","","","","","","",4,"","","","","",""]
[23,{"$nulls":3},"Eチーム3区",{"$nulls":5},"","","","","","","","",4,"","","","","",""]
[24,{"$nulls":3},"Eチーム4区",{"$nulls":5},"","","","","","","","",4,"","","","","",""]
[25,{"$nulls":3},"Eチーム5区",{"$nulls":5},"","",{"$f":"IF($C27=\"\",\"\",D27)","v":""},"",{"$f":"IF($C27=\"\",\"\",10)","v":""},{"$f":"IF($C27=\"\",\"\",$H$2)","v":""},{"$f":"IF($C27=\"\",\"\",K27)","v":""},"",4,"","","","","",""]
[26,null,"Aチーム補員","Aチーム補員","A補員",{"$nulls":5},{"$error":"#VALUE!"},"Aチーム補員()",{"$f":"IF($C28=\"\",\"\",D28)","v":"Aチーム補員"},2,10,"",{"$f":"IF($C28=\"\",\"\",K28)","v":{"$error":"#VALUE!"}},{"$f":"IF(C28=\"\",\"\",表紙!$I$10&\"9\")","v":"R00609"},{"$nulls":5},"",""]
[27,null,"Bチーム補員","Bチーム補員","B補員",{"$nulls":5},{"$error":"#VALUE!"},"Bチーム補員()","Bチーム補員",2,10,"",{"$error":"#VALUE!"},{"$f":"IF(C29=\"\",\"\",表紙!$I$10&\"9\")","v":"R00609"},{"$nulls":5},"",""]
[28,{"$nulls":3},"C補員",{"$nulls":5},"","","","","","","",{"$f":"IF(C30=\"\",\"\",表紙!$I$10&\"9\")","v":""},{"$nulls":5},"",""]
[29,{"$nulls":3},"D補員",{"$nulls":5},"","","","","","","",{"$f":"IF(C31=\"\",\"\",表紙!$I$10&\"9\")","v":""},{"$nulls":5},"",""]
[30,{"$nulls":3},"E補員",{"$nulls":5},"","","","","","","",{"$f":"IF(C32=\"\",\"\",表紙!$I$10&\"9\")","v":""},{"$nulls":5},"",""]

{"sheet":"syozoku","index":6,"n_rows":51,"n_cols":6,"rows_kept":51}
["DB","N1","N2","N3","KC","code"]
[1,"ﾀｶｻｷｼﾘｯｷｮｳ","高崎市陸上競技協会","高崎市陸協",10,1]
[2,"ｱｶﾞﾂﾏｼﾝﾚｲｸﾗﾌﾞ","吾妻榛嶺クラブ","吾妻榛嶺ｸﾗﾌﾞ",10,2]
[3,"ｳｽｲｸﾗﾌﾞ","碓氷陸上競技クラブ","碓氷ｸﾗﾌﾞ",10,3]
[4,"ﾀﾃﾊﾞﾔｼｸﾗﾌﾞ","館林陸上競技クラブ","館林ｸﾗﾌﾞ",10,4]
[5,"ｼﾌﾞｶﾜｸﾗﾌﾞ","渋川陸上競技クラブ","渋川ｸﾗﾌﾞ",10,5]
[6,"ﾌｼﾞｵｶｸﾗﾌﾞ","藤岡市陸上競技クラブ","藤岡ｸﾗﾌﾞ",10,6]
[7,"ｾﾀｸﾗﾌﾞ","勢多陸上競技クラブ","勢多ｸﾗﾌﾞ",10,7]
[8,"ﾏｴﾊﾞｼｼﾘｯｷｮｳ","前橋市陸上競技協会","前橋市陸協",10,8]
[9,"ｷﾘｭｳｼﾘｯｷｮｳ","桐生市陸上競技協会","桐生市陸協",10,9]
[10,"ﾄﾈｸﾗﾌﾞ","利根陸上競技クラブ","利根ｸﾗﾌﾞ",10,10]
[11,"ﾇﾏﾀｸﾗﾌﾞ","沼田市陸上クラブ","沼田ｸﾗﾌﾞ",10,11]
[12,"ﾄﾐｵｶｼﾘｯｷｮｳ","富岡市陸上競技協会","富岡市陸協",10,12]
[13,"ｲｾｻｷｸﾗﾌﾞ","伊勢崎陸上競技クラブ","伊勢崎ｸﾗﾌﾞ",10,13]
[14,"ﾆｯﾀｸﾗﾌﾞ","新田陸上競技倶楽部","新田倶楽部",10,14]
[15,"ｼﾞｮｳｼｭｳAC","上州アスリートクラブ","上州ｱｽﾘｰﾄｸﾗﾌﾞ",10,15]
[16,"ｵｵﾀｼﾘｯｷｮｳ","太田市陸上競技協会","太田市陸協",10,16]
[17,"ｱﾝﾅｶｼﾘｯｷｮｳ","安中市陸上競技協会","安中市陸協",10,17]
[18,"ｻｶｲｸﾗﾌﾞ","境陸上競技クラブ","境ｸﾗﾌﾞ",10,18]
[19,"ﾁｰﾑK","チームＫ","ﾁｰﾑK",10,19]
[20,"ﾀﾁﾊﾞﾅRC","たちばなＲ．Ｃ","たちばなR.C",10,20]
[21,"ｱﾗﾏｷｯｽﾞ","アラマキッズ","ｱﾗﾏｷｯｽﾞ",10,21]
[22,"ｵｵﾀSA","おおたｽﾎﾟｰﾂｱｶﾃﾞﾐｰ","おおたSA",10,22]
[23,"ESP","ＥＳＰｱｽﾚﾁｯｸｸﾗﾌﾞ","ESP",10,23]
[24,"ﾄﾞﾘｶﾑｵｵﾀ","どりかむ太田","どりかむ太田",10,24]
[25,"ｶﾈｺRC","金古ランニングクラブ","金古RC",10,25]
[26,"SAﾀﾏﾑﾗ","ｽｰﾊﾟｰｱｽﾘｰﾄ玉村","SA玉村",10,26]
[27,"ﾄﾘﾍｲAC","登利平ｱｽﾘｰﾄｸﾗﾌﾞ","登利平AC",10,27]
[28,"ﾅｶﾉｼﾞｮｳAC","中之条AC","中之条AC",10,28]
[29,"ﾗﾝﾆﾝｸﾞﾁｰﾑJOY","ランニングチームJOY","JOY",10,29]
[30,"TTM","TTM","TTM",10,30]
[31,{"$nulls":4},31]
[32,{"$nulls":4},32]
[33,{"$nulls":4},33]
[34,{"$nulls":4},34]
[35,{"$nulls":4},35]
[36,{"$nulls":4},36]
[37,{"$nulls":4},37]
[38,{"$nulls":4},38]
[39,{"$nulls":4},39]
[40,{"$nulls":4},40]
[41,{"$nulls":4},41]
[42,{"$nulls":4},42]
[43,{"$nulls":4},43]
[44,{"$nulls":4},44]
[45,{"$nulls":4},45]
[46,{"$nulls":4},46]
[47,{"$nulls":4},47]
[48,{"$nulls":4},48]
[49,{"$nulls":4},49]
[50,{"$nulls":4},50]